The text below is selected, press Ctrl+C to copy to your clipboard. (⌘+C on Mac) No line numbers will be copied.
Guest
Cmake log
By Guest on 13th March 2019 03:51:52 PM | Syntax: TEXT | Views: 7



New paste | Download | Show/Hide line no. | Copy text to clipboard
  1. Determining if the pthread_create exist failed with the following output:
  2. Change Dir: /home/wins/Ethereum/retesteth/build/CMakeFiles/CMakeTmp
  3.  
  4. Run Build Command:"/usr/bin/make" "cmTC_cb1a2/fast"
  5. /usr/bin/make -f CMakeFiles/cmTC_cb1a2.dir/build.make CMakeFiles/cmTC_cb1a2.dir/build
  6. make[1]: Entering directory '/home/wins/Ethereum/retesteth/build/CMakeFiles/CMakeTmp'
  7. Building C object CMakeFiles/cmTC_cb1a2.dir/CheckSymbolExists.c.o
  8. /usr/bin/cc    -o CMakeFiles/cmTC_cb1a2.dir/CheckSymbolExists.c.o   -c /home/wins/Ethereum/retesteth/build/CMakeFiles/CMakeTmp/CheckSymbolExists.c
  9. Linking C executable cmTC_cb1a2
  10. /usr/local/bin/cmake -E cmake_link_script CMakeFiles/cmTC_cb1a2.dir/link.txt --verbose=1
  11. /usr/bin/cc      CMakeFiles/cmTC_cb1a2.dir/CheckSymbolExists.c.o  -o cmTC_cb1a2
  12. CMakeFiles/cmTC_cb1a2.dir/CheckSymbolExists.c.o: In function `main':
  13. CheckSymbolExists.c:(.text+0x16): undefined reference to `pthread_create'
  14. collect2: error: ld returned 1 exit status
  15. CMakeFiles/cmTC_cb1a2.dir/build.make:97: recipe for target 'cmTC_cb1a2' failed
  16. make[1]: *** [cmTC_cb1a2] Error 1
  17. make[1]: Leaving directory '/home/wins/Ethereum/retesteth/build/CMakeFiles/CMakeTmp'
  18. Makefile:126: recipe for target 'cmTC_cb1a2/fast' failed
  19. make: *** [cmTC_cb1a2/fast] Error 2
  20.  
  21. File /home/wins/Ethereum/retesteth/build/CMakeFiles/CMakeTmp/CheckSymbolExists.c:
  22. /* */
  23. #include <pthread.h>
  24.  
  25. int main(int argc, char** argv)
  26. {
  27.   (void)argv;
  28. #ifndef pthread_create
  29.   return ((int*)(&pthread_create))[argc];
  30. #else
  31.   (void)argc;
  32.   return 0;
  33. #endif
  34. }
  35.  
  36. Determining if the function pthread_create exists in the pthreads failed with the following output:
  37. Change Dir: /home/wins/Ethereum/retesteth/build/CMakeFiles/CMakeTmp
  38.  
  39. Run Build Command:"/usr/bin/make" "cmTC_5cde5/fast"
  40. /usr/bin/make -f CMakeFiles/cmTC_5cde5.dir/build.make CMakeFiles/cmTC_5cde5.dir/build
  41. make[1]: Entering directory '/home/wins/Ethereum/retesteth/build/CMakeFiles/CMakeTmp'
  42. Building C object CMakeFiles/cmTC_5cde5.dir/CheckFunctionExists.c.o
  43. /usr/bin/cc   -DCHECK_FUNCTION_EXISTS=pthread_create   -o CMakeFiles/cmTC_5cde5.dir/CheckFunctionExists.c.o   -c /usr/local/share/cmake-3.9/Modules/CheckFunctionExists.c
  44. Linking C executable cmTC_5cde5
  45. /usr/local/bin/cmake -E cmake_link_script CMakeFiles/cmTC_5cde5.dir/link.txt --verbose=1
  46. /usr/bin/cc  -DCHECK_FUNCTION_EXISTS=pthread_create    CMakeFiles/cmTC_5cde5.dir/CheckFunctionExists.c.o  -o cmTC_5cde5 -lpthreads
  47. /usr/bin/ld: cannot find -lpthreads
  48. collect2: error: ld returned 1 exit status
  49. CMakeFiles/cmTC_5cde5.dir/build.make:97: recipe for target 'cmTC_5cde5' failed
  50. make[1]: *** [cmTC_5cde5] Error 1
  51. make[1]: Leaving directory '/home/wins/Ethereum/retesteth/build/CMakeFiles/CMakeTmp'
  52. Makefile:126: recipe for target 'cmTC_5cde5/fast' failed
  53. make: *** [cmTC_5cde5/fast] Error 2



  • Recent Pastes